Hello,
We're testing confluence product and it's showing this message:
We’re having trouble loading the spaces. Try refreshing the page.
Atlassian and bitbucket loads OK. Attempted to clear browsing data or login cognito mode don't help.
Chrome shows dump:
cc-fe-bifrost.prod-east.frontend.public.atl-paas.net/assets/master/force-update.json:1 Failed to load resource: the server responded with a status of 404 ()Understand this errorAI bundle.esm.js:63 Uncaught (in promise) Error: GraphQL error: Exception querying the remote GraphQL service: io.atlassian.platform.micros.asynchttp.UnexpectedHttpStatusResponseException: Unexpected status code 429 at new t (bundle.esm.js:63:28) at bundle.esm.js:1247:40 at bundle.esm.js:1569:25 at Set.forEach () at bundle.esm.js:1567:32 at Map.forEach () at e.broadcastQueries (bundle.esm.js:1555:22) at bundle.esm.js:1659:27 at Object.next (Observable.js:322:23) at b (Observable.js:135:18)Understand this errorAI rest/create-dialog/1.0/spaces?promotedSpacesLimit=1&otherSpacesLimit=1&promotedSpaceKey=:1 Failed to load resource: the server responded with a status of 500 ()Understand this errorAI cc-fe-bifrost.prod-east.frontend.public.atl-paas.net/assets/master/force-update.json:1 Failed to load resource: the server responded with a status of 404 ()Understand this errorAI cc-fe-bifrost.prod-east.frontend.public.atl-paas.net/assets/master/force-update.json:1 Failed to load resource: the server responded with a status of 404 ()Understand this errorAI 2react-dom.profiling.min.js:205 Error: GraphQL error: Exception querying the remote GraphQL service: io.atlassian.platform.micros.asynchttp.UnexpectedHttpStatusResponseException: Unexpected status code 429 GraphQL error: Exception querying the remote GraphQL service: io.atlassian.platform.micros.asynchttp.UnexpectedHttpStatusResponseException: Unexpected status code 429 GraphQL error: Exception querying the remote GraphQL service: io.atlassian.platform.micros.asynchttp.UnexpectedHttpStatusResponseException: Unexpected status code 429 at new t (bundle.esm.js:63:28) at t.getCurrentResult (bundle.esm.js:159:28) at t.getQueryResult (react-hooks.esm.js:265:62) at o.getExecuteResult (react-hooks.esm.js:73:32) at t.execute (react-hooks.esm.js:106:51) at v (react-hooks.esm.js:380:95) at f (react-hooks.esm.js:354:42) at h (react-hooks.esm.js:397:12) at i (use-query.ts:12:23) at ProductHome.tsx:54:35
Any suggestion pls?