<span>[ERROR] Tests run: 3, Failures: 1, Errors: 0, Skipped: 2, Time elapsed: 2.865 s <<< FAILURE! - in TestSuite</span> <span>[ERROR] browsersetup(Test_cases_.Login_UI_TC01) Time elapsed: 2.455 s <<< FAILURE!</span> <span>org.openqa.selenium.SessionNotCreatedException: </span><span>Could not start a new session. Response code 500. Message: unknown error: cannot find Chrome binary</span> <span>Build info: version: '4.0.0-beta-4', revision: '29f46d02dd'</span> <span>System info: host: '9280fb1d-52c5-42ac-b7bb-391fd6e44821-gvmvf', ip: '10.39.128.38', <u><a href="http://os.name/" target="_blank" rel="noreferrer noopener nofollow" title="http://os.name/">os.name</a></u>: 'Linux', os.arch: 'amd64', os.version: '5.4.92-flatcar', java.version: '1.8.0_121'</span> <span>Driver info: org.openqa.selenium.chrome.ChromeDriver</span> <span>Command: [null, newSession {capabilities=[Capabilities {browserName: chrome, goog:chromeOptions: {args: [--headless], extensions: []}}], desiredCapabilities=Capabilities {browserName: chrome, goog:chromeOptions: {args: [--headless], extensions: []}}}]</span>