<span>+ mvn -B verify</span>
<span>[INFO] Scanning for projects...</span>
<span>[INFO] ------------------------------------------------------------------------</span>
<span>[INFO] BUILD FAILURE</span>
<span>[INFO] ------------------------------------------------------------------------</span>
<span>[INFO] Total time: 0.098 s</span>
<span>[INFO] Finished at: 2022-09-29T12:59:01Z</span>
<span>[INFO] ------------------------------------------------------------------------</span>
<span>[ERROR] The goal you specified requires a project to execute but there is no POM in this directory (/opt/atlassian/pipelines/agent/build). Please verify you invoked Maven from the correct directory. -> [Help 1]</span>
<span>[ERROR] </span>
<span>[ERROR] To see the full stack trace of the errors, re-run Maven with the -e switch.</span>
<span>[ERROR] Re-run Maven using the -X switch to enable full debug logging.</span>
<span>[ERROR] </span>
<span>[ERROR] For more information about the errors and possible solutions, please read the following articles:</span>
<span>[ERROR] [Help 1] <a href="http://cwiki.apache.org/confluence/display/MAVEN/MissingProjectException" rel="noopener nofollow noreferrer" target="_blank">http://cwiki.apache.org/confluence/display/MAVEN/MissingProjectException</a></span>