Getting below error when executing command atlas-run on dos prompt to execute the newly creted jira plugin
sun.security.provider.certpath.SunCertPathBuilderException: unable to find valid certification path to requested target
[INFO] ------------------------------------------------------------------------
[INFO] BUILD FAILURE
[INFO] ------------------------------------------------------------------------
[INFO] Total time: 01:01 min
[INFO] Finished at: 2021-10-18T11:28:03+05:30
[INFO] ------------------------------------------------------------------------
[ERROR] Failed to execute goal on project plugin57: Could not resolve dependencies for project mypluginscts:plugin57:atlassian-plugin:1.0.0-SNAPSHOT: Failed to collect dependencies at com.atlassian.jira:jira-api:jar:7.13.0: Failed to read artifact descriptor for com.atlassian.jira:jira-api:jar:7.13.0: Could not transfer artifact com.atlassian.jira:jira-project:pom:7.13.0 from/to atlassian-public (https://maven.atlassian.com/repository/public): PKIX path building failed: sun.security.provider.certpath.SunCertPathBuilderException: unable to find valid certification path to requested target -> [Help 1]
[ERROR]
[ERROR] To see the full stack trace of the errors, re-run Maven with the -e switch.
[ERROR] Re-run Maven using the -X switch to enable full debug logging.
[ERROR]
[ERROR] For more information about the errors and possible solutions, please read the following articles:
[ERROR] [Help 1] http://cwiki.apache.org/confluence/display/MAVEN/DependencyResolutionException