Hi,
I am quite new to plugin developlment in Jira and have tried setting up an environment for testing code as explained in the Script Runner documentation: https://scriptrunner.adaptavist.com/6.10.0/jira/testing.html
I managed to set up the system, but fail when it comes to running "mvn jira:debug".
Maven fails at some point with the following error:
[INFO] ------------------------------------------------------------------------
[INFO] BUILD FAILURE
[INFO] ------------------------------------------------------------------------
[INFO] Total time: 43.240 s
[INFO] Finished at: 2020-10-06T08:35:04+02:00
[INFO] ------------------------------------------------------------------------
[ERROR] Failed to execute goal com.atlassian.maven.plugins:jira-maven-plugin:8.1.1:debug (default-cli) on project sr-sample
-plugin-jira: Unable to get the POM for the artifact 'com.atlassian.jira:atlassian-jira-webapp:8.0.0'. Verify the artifact
parameter.: Some problems were encountered while processing the POMs:
[ERROR] [ERROR] Unresolveable build extension: Plugin com.atlassian.maven.plugins:artifactory-staging-maven-plugin:2.0.0 or
one of its dependencies could not be resolved: Failure to find com.atlassian.maven.plugins:artifactory-staging-maven-plugi
n:jar:2.0.0 in https://repo.maven.apache.org/maven2 was cached in the local repository, resolution will not be reattempted
until the update interval of central has elapsed or updates are forced @: 1 problem was encountered while building the effe
ctive model for com.atlassian.jira:atlassian-jira-webapp:8.0.0
[ERROR] [ERROR] Unresolveable build extension: Plugin com.atlassian.maven.plugins:artifactory-staging-maven-plugin:2.0.0 or
one of its dependencies could not be resolved: Failure to find com.atlassian.maven.plugins:artifactory-staging-maven-plugi
n:jar:2.0.0 in https://repo.maven.apache.org/maven2 was cached in the local repository, resolution will not be reattempted
[ERROR] -> [Help 1]
org.apache.maven.lifecycle.LifecycleExecutionException: Failed to execute goal com.atlassian.maven.plugins:jira-maven-plugi
n:8.1.1:debug (default-cli) on project sr-sample-plugin-jira: Unable to get the POM for the artifact 'com.atlassian.jira:at
lassian-jira-webapp:8.0.0'. Verify the artifact parameter.
at org.apache.maven.lifecycle.internal.MojoExecutor.execute (MojoExecutor.java:215)
at org.apache.maven.lifecycle.internal.MojoExecutor.execute (MojoExecutor.java:156)
at org.apache.maven.lifecycle.internal.MojoExecutor.execute (MojoExecutor.java:148)
at org.apache.maven.lifecycle.internal.LifecycleModuleBuilder.buildProject (LifecycleModuleBuilder.java:117)
at org.apache.maven.lifecycle.internal.LifecycleModuleBuilder.buildProject (LifecycleModuleBuilder.java:81)
at org.apache.maven.lifecycle.internal.builder.singlethreaded.SingleThreadedBuilder.build (SingleThreadedBuilder.java:5
6)
at org.apache.maven.lifecycle.internal.LifecycleStarter.execute (LifecycleStarter.java:128)
at org.apache.maven.DefaultMaven.doExecute (DefaultMaven.java:305)
at org.apache.maven.DefaultMaven.doExecute (DefaultMaven.java:192)
at org.apache.maven.DefaultMaven.execute (DefaultMaven.java:105)
at org.apache.maven.cli.MavenCli.execute (MavenCli.java:957)
at org.apache.maven.cli.MavenCli.doMain (MavenCli.java:289)
at org.apache.maven.cli.MavenCli.main (MavenCli.java:193)
at sun.reflect.NativeMethodAccessorImpl.invoke0 (Native Method)
at sun.reflect.NativeMethodAccessorImpl.invoke (NativeMethodAccessorImpl.java:62)
at sun.reflect.DelegatingMethodAccessorImpl.invoke (DelegatingMethodAccessorImpl.java:43)
at java.lang.reflect.Method.invoke (Method.java:498)
at org.codehaus.plexus.classworlds.launcher.Launcher.launchEnhanced (Launcher.java:282)
at org.codehaus.plexus.classworlds.launcher.Launcher.launch (Launcher.java:225)
at org.codehaus.plexus.classworlds.launcher.Launcher.mainWithExitCode (Launcher.java:406)
at org.codehaus.plexus.classworlds.launcher.Launcher.main (Launcher.java:347)
Caused by: org.apache.maven.plugin.MojoExecutionException: Unable to get the POM for the artifact 'com.atlassian.jira:atlas
sian-jira-webapp:8.0.0'. Verify the artifact parameter.
at org.apache.maven.plugins.help.AbstractHelpMojo.getMavenProject (AbstractHelpMojo.java:222)
at org.apache.maven.plugins.help.EffectivePomMojo.execute (EffectivePomMojo.java:113)
at org.apache.maven.plugin.DefaultBuildPluginManager.executeMojo (DefaultBuildPluginManager.java:137)
at org.twdata.maven.mojoexecutor.MojoExecutor.executeMojo (MojoExecutor.java:119)
at com.atlassian.maven.plugins.amps.util.MojoUtils.execute (MojoUtils.java:36)
at com.atlassian.maven.plugins.amps.util.MojoUtils.executeWithMergedConfig (MojoUtils.java:66)
at com.atlassian.maven.plugins.amps.MavenGoals.generateEffectivePom (MavenGoals.java:2031)
at com.atlassian.maven.plugins.amps.product.AbstractWebappProductHandler.addOverridesFromProductPom (AbstractWebappProd
uctHandler.java:150)
at com.atlassian.maven.plugins.amps.product.AbstractProductHandler.start (AbstractProductHandler.java:84)
at com.atlassian.maven.plugins.amps.RunMojo.startProducts (RunMojo.java:137)
at com.atlassian.maven.plugins.amps.DebugMojo.doExecute (DebugMojo.java:86)
at com.atlassian.maven.plugins.amps.AbstractProductHandlerMojo.execute (AbstractProductHandlerMojo.java:782)
at org.apache.maven.plugin.DefaultBuildPluginManager.executeMojo (DefaultBuildPluginManager.java:137)
at org.apache.maven.lifecycle.internal.MojoExecutor.execute (MojoExecutor.java:210)
at org.apache.maven.lifecycle.internal.MojoExecutor.execute (MojoExecutor.java:156)
at org.apache.maven.lifecycle.internal.MojoExecutor.execute (MojoExecutor.java:148)
at org.apache.maven.lifecycle.internal.LifecycleModuleBuilder.buildProject (LifecycleModuleBuilder.java:117)
at org.apache.maven.lifecycle.internal.LifecycleModuleBuilder.buildProject (LifecycleModuleBuilder.java:81)
at org.apache.maven.lifecycle.internal.builder.singlethreaded.SingleThreadedBuilder.build (SingleThreadedBuilder.java:5
6)
at org.apache.maven.lifecycle.internal.LifecycleStarter.execute (LifecycleStarter.java:128)
at org.apache.maven.DefaultMaven.doExecute (DefaultMaven.java:305)
at org.apache.maven.DefaultMaven.doExecute (DefaultMaven.java:192)
at org.apache.maven.DefaultMaven.execute (DefaultMaven.java:105)
at org.apache.maven.cli.MavenCli.execute (MavenCli.java:957)
at org.apache.maven.cli.MavenCli.doMain (MavenCli.java:289)
at org.apache.maven.cli.MavenCli.main (MavenCli.java:193)
at sun.reflect.NativeMethodAccessorImpl.invoke0 (Native Method)
at sun.reflect.NativeMethodAccessorImpl.invoke (NativeMethodAccessorImpl.java:62)
at sun.reflect.DelegatingMethodAccessorImpl.invoke (DelegatingMethodAccessorImpl.java:43)
at java.lang.reflect.Method.invoke (Method.java:498)
at org.codehaus.plexus.classworlds.launcher.Launcher.launchEnhanced (Launcher.java:282)
at org.codehaus.plexus.classworlds.launcher.Launcher.launch (Launcher.java:225)
at org.codehaus.plexus.classworlds.launcher.Launcher.mainWithExitCode (Launcher.java:406)
at org.codehaus.plexus.classworlds.launcher.Launcher.main (Launcher.java:347)
Caused by: org.apache.maven.project.ProjectBuildingException: Some problems were encountered while processing the POMs:
[ERROR] Unresolveable build extension: Plugin com.atlassian.maven.plugins:artifactory-staging-maven-plugin:2.0.0 or one of
its dependencies could not be resolved: Failure to find com.atlassian.maven.plugins:artifactory-staging-maven-plugin:jar:2.
0.0 in https://repo.maven.apache.org/maven2 was cached in the local repository, resolution will not be reattempted until th
at org.apache.maven.project.DefaultProjectBuilder.build (DefaultProjectBuilder.java:207)
at org.apache.maven.project.DefaultProjectBuilder.build (DefaultProjectBuilder.java:124)
at org.apache.maven.plugins.help.AbstractHelpMojo.getMavenProject (AbstractHelpMojo.java:218)
at org.apache.maven.plugins.help.EffectivePomMojo.execute (EffectivePomMojo.java:113)
at org.apache.maven.plugin.DefaultBuildPluginManager.executeMojo (DefaultBuildPluginManager.java:137)
at org.twdata.maven.mojoexecutor.MojoExecutor.executeMojo (MojoExecutor.java:119)
at com.atlassian.maven.plugins.amps.util.MojoUtils.execute (MojoUtils.java:36)
at com.atlassian.maven.plugins.amps.util.MojoUtils.executeWithMergedConfig (MojoUtils.java:66)
at com.atlassian.maven.plugins.amps.MavenGoals.generateEffectivePom (MavenGoals.java:2031)
at com.atlassian.maven.plugins.amps.product.AbstractWebappProductHandler.addOverridesFromProductPom (AbstractWebappProd
uctHandler.java:150)
at com.atlassian.maven.plugins.amps.product.AbstractProductHandler.start (AbstractProductHandler.java:84)
at com.atlassian.maven.plugins.amps.RunMojo.startProducts (RunMojo.java:137)
at com.atlassian.maven.plugins.amps.DebugMojo.doExecute (DebugMojo.java:86)
at com.atlassian.maven.plugins.amps.AbstractProductHandlerMojo.execute (AbstractProductHandlerMojo.java:782)
at org.apache.maven.plugin.DefaultBuildPluginManager.executeMojo (DefaultBuildPluginManager.java:137)
at org.apache.maven.lifecycle.internal.MojoExecutor.execute (MojoExecutor.java:210)
at org.apache.maven.lifecycle.internal.MojoExecutor.execute (MojoExecutor.java:156)
at org.apache.maven.lifecycle.internal.MojoExecutor.execute (MojoExecutor.java:148)
at org.apache.maven.lifecycle.internal.LifecycleModuleBuilder.buildProject (LifecycleModuleBuilder.java:117)
at org.apache.maven.lifecycle.internal.LifecycleModuleBuilder.buildProject (LifecycleModuleBuilder.java:81)
at org.apache.maven.lifecycle.internal.builder.singlethreaded.SingleThreadedBuilder.build (SingleThreadedBuilder.java:5
6)
at org.apache.maven.lifecycle.internal.LifecycleStarter.execute (LifecycleStarter.java:128)
at org.apache.maven.DefaultMaven.doExecute (DefaultMaven.java:305)
at org.apache.maven.DefaultMaven.doExecute (DefaultMaven.java:192)
at org.apache.maven.DefaultMaven.execute (DefaultMaven.java:105)
at org.apache.maven.cli.MavenCli.execute (MavenCli.java:957)
at org.apache.maven.cli.MavenCli.doMain (MavenCli.java:289)
at org.apache.maven.cli.MavenCli.main (MavenCli.java:193)
at sun.reflect.NativeMethodAccessorImpl.invoke0 (Native Method)
at sun.reflect.NativeMethodAccessorImpl.invoke (NativeMethodAccessorImpl.java:62)
at sun.reflect.DelegatingMethodAccessorImpl.invoke (DelegatingMethodAccessorImpl.java:43)
at java.lang.reflect.Method.invoke (Method.java:498)
at org.codehaus.plexus.classworlds.launcher.Launcher.launchEnhanced (Launcher.java:282)
at org.codehaus.plexus.classworlds.launcher.Launcher.launch (Launcher.java:225)
at org.codehaus.plexus.classworlds.launcher.Launcher.mainWithExitCode (Launcher.java:406)
at org.codehaus.plexus.classworlds.launcher.Launcher.main (Launcher.java:347)
Caused by: org.apache.maven.model.building.ModelBuildingException: 1 problem was encountered while building the effective m
odel for com.atlassian.jira:atlassian-jira-webapp:8.0.0
[ERROR] Unresolveable build extension: Plugin com.atlassian.maven.plugins:artifactory-staging-maven-plugin:2.0.0 or one of
its dependencies could not be resolved: Failure to find com.atlassian.maven.plugins:artifactory-staging-maven-plugin:jar:2.
0.0 in https://repo.maven.apache.org/maven2 was cached in the local repository, resolution will not be reattempted until th
at org.apache.maven.model.building.DefaultModelProblemCollector.newModelBuildingException (DefaultModelProblemCollector
.java:197)
at org.apache.maven.model.building.DefaultModelBuilder.build (DefaultModelBuilder.java:498)
at org.apache.maven.model.building.DefaultModelBuilder.build (DefaultModelBuilder.java:440)
at org.apache.maven.model.building.DefaultModelBuilder.build (DefaultModelBuilder.java:430)
at org.apache.maven.project.DefaultProjectBuilder.build (DefaultProjectBuilder.java:173)
at org.apache.maven.project.DefaultProjectBuilder.build (DefaultProjectBuilder.java:124)
at org.apache.maven.plugins.help.AbstractHelpMojo.getMavenProject (AbstractHelpMojo.java:218)
at org.apache.maven.plugins.help.EffectivePomMojo.execute (EffectivePomMojo.java:113)
at org.apache.maven.plugin.DefaultBuildPluginManager.executeMojo (DefaultBuildPluginManager.java:137)
at org.twdata.maven.mojoexecutor.MojoExecutor.executeMojo (MojoExecutor.java:119)
at com.atlassian.maven.plugins.amps.util.MojoUtils.execute (MojoUtils.java:36)
at com.atlassian.maven.plugins.amps.util.MojoUtils.executeWithMergedConfig (MojoUtils.java:66)
at com.atlassian.maven.plugins.amps.MavenGoals.generateEffectivePom (MavenGoals.java:2031)
at com.atlassian.maven.plugins.amps.product.AbstractWebappProductHandler.addOverridesFromProductPom (AbstractWebappProd
uctHandler.java:150)
at com.atlassian.maven.plugins.amps.product.AbstractProductHandler.start (AbstractProductHandler.java:84)
at com.atlassian.maven.plugins.amps.RunMojo.startProducts (RunMojo.java:137)
at com.atlassian.maven.plugins.amps.DebugMojo.doExecute (DebugMojo.java:86)
at com.atlassian.maven.plugins.amps.AbstractProductHandlerMojo.execute (AbstractProductHandlerMojo.java:782)
at org.apache.maven.plugin.DefaultBuildPluginManager.executeMojo (DefaultBuildPluginManager.java:137)
at org.apache.maven.lifecycle.internal.MojoExecutor.execute (MojoExecutor.java:210)
at org.apache.maven.lifecycle.internal.MojoExecutor.execute (MojoExecutor.java:156)
at org.apache.maven.lifecycle.internal.MojoExecutor.execute (MojoExecutor.java:148)
at org.apache.maven.lifecycle.internal.LifecycleModuleBuilder.buildProject (LifecycleModuleBuilder.java:117)
at org.apache.maven.lifecycle.internal.LifecycleModuleBuilder.buildProject (LifecycleModuleBuilder.java:81)
at org.apache.maven.lifecycle.internal.builder.singlethreaded.SingleThreadedBuilder.build (SingleThreadedBuilder.java:5
6)
at org.apache.maven.lifecycle.internal.LifecycleStarter.execute (LifecycleStarter.java:128)
at org.apache.maven.DefaultMaven.doExecute (DefaultMaven.java:305)
at org.apache.maven.DefaultMaven.doExecute (DefaultMaven.java:192)
at org.apache.maven.DefaultMaven.execute (DefaultMaven.java:105)
at org.apache.maven.cli.MavenCli.execute (MavenCli.java:957)
at org.apache.maven.cli.MavenCli.doMain (MavenCli.java:289)
at org.apache.maven.cli.MavenCli.main (MavenCli.java:193)
at sun.reflect.NativeMethodAccessorImpl.invoke0 (Native Method)
at sun.reflect.NativeMethodAccessorImpl.invoke (NativeMethodAccessorImpl.java:62)
at sun.reflect.DelegatingMethodAccessorImpl.invoke (DelegatingMethodAccessorImpl.java:43)
at java.lang.reflect.Method.invoke (Method.java:498)
at org.codehaus.plexus.classworlds.launcher.Launcher.launchEnhanced (Launcher.java:282)
at org.codehaus.plexus.classworlds.launcher.Launcher.launch (Launcher.java:225)
at org.codehaus.plexus.classworlds.launcher.Launcher.mainWithExitCode (Launcher.java:406)
at org.codehaus.plexus.classworlds.launcher.Launcher.main (Launcher.java:347)
[ERROR]
[ERROR] Re-run Maven using the -X switch to enable full debug logging.
[ERROR]
[ERROR] For more information about the errors and possible solutions, please read the following articles:
[ERROR] [Help 1] http://cwiki.apache.org/confluence/display/MAVEN/MojoExecutionException
I am sort of lost at the moment where to start looking how to resolve this, so any directions are highly appreciated.
Thank you,
Anna