Hi I am following the Create a HelloWorld plugin project tutorial and encountered a build error. The script was looking for a file (c:\windows\system 32\myPlugin\pom.xml) that doesnt exist. In fact, there is no "myPlugin" directory in the location specified. Help would be appreciated. Here's the output:
C:\Windows\System32>atlas-create-jira-plugin
Executing: "C:\Applications\Atlassian\atlassian-plugin-sdk-6.3.12\apache-maven-3.2.1\bin\mvn.bat" com.atlassian.maven.plugins:maven-jira-plugin:"6.3.21":create -gs C:\Applications\Atlassian\atlassian-plugin-sdk-6.3.12\apache-maven-3.2.1/conf/settings.xml
Java HotSpot(TM) Client VM warning: ignoring option MaxPermSize=256M; support was removed in 8.0
[INFO] Scanning for projects...
[INFO]
[INFO] Using the builder org.apache.maven.lifecycle.internal.builder.singlethreaded.SingleThreadedBuilder with a thread count of 1
[INFO]
[INFO] ------------------------------------------------------------------------
[INFO] Building Maven Stub Project (No POM) 1
[INFO] ------------------------------------------------------------------------
[INFO]
[INFO] --- maven-jira-plugin:6.3.21:create (default-cli) @ standalone-pom ---
Dec 07, 2018 1:38:32 PM java.util.prefs.WindowsPreferences <init>
WARNING: Could not open/create prefs root node Software\JavaSoft\Prefs at root 0x80000002. Windows RegCreateKeyEx(...) returned error code 5.
[INFO] Google Analytics Tracking is enabled to collect AMPS usage statistics.
[INFO] Although no personal information is sent, you may disable tracking by adding <allowGoogleTracking>false</allowGoogleTracking> to the amps plugin configuration in your pom.xml
[INFO] Sending event to Google Analytics: AMPS:jira - Create Plugin
[INFO] using stable product version: 7.12.0
[INFO] using stable data version: 7.12.0
Define value for groupId: : com.atlassian.tutorial
Define value for artifactId: : myPlugin
Define value for version: 1.0.0-SNAPSHOT: : 1.0.0-SNAPSHOT
Define value for package: com.atlassian.tutorial: : com.atlassian.tutorial.myPlugin
Confirm properties configuration:
groupId: com.atlassian.tutorial
artifactId: myPlugin
version: 1.0.0-SNAPSHOT
package: com.atlassian.tutorial.myPlugin
Y: : Y
[INFO] Setting property: classpath.resource.loader.class => 'org.codehaus.plexus.velocity.ContextClassLoaderResourceLoader'.
[INFO] Setting property: velocimacro.messages.on => 'false'.
[INFO] Setting property: resource.loader => 'classpath'.
[INFO] Setting property: resource.manager.logwhenfound => 'false'.
[INFO] Generating project in Batch mode
[INFO] Archetype repository missing. Using the one from [com.atlassian.maven.archetypes:jira-plugin-archetype:5 -> https://maven.atlassian.com/public] found in catalog internal
[ERROR] org.apache.maven.archetype.exception.ArchetypeGenerationFailure: Error merging velocity templates: C:\Windows\System32\myPlugin\pom.xml (The system cannot find the path specified)
org.apache.maven.archetype.exception.ArchetypeGenerationFailure: org.apache.maven.archetype.exception.ArchetypeGenerationFailure: Error merging velocity templates: C:\Windows\System32\myPlugin\pom.xml (The system cannot find the path specified)
at org.apache.maven.archetype.generator.DefaultFilesetArchetypeGenerator.generateArchetype(DefaultFilesetArchetypeGenerator.java:278)
at org.apache.maven.archetype.generator.DefaultArchetypeGenerator.processFileSetArchetype(DefaultArchetypeGenerator.java:213)
at org.apache.maven.archetype.generator.DefaultArchetypeGenerator.generateArchetype(DefaultArchetypeGenerator.java:128)
at org.apache.maven.archetype.generator.DefaultArchetypeGenerator.generateArchetype(DefaultArchetypeGenerator.java:286)
at org.apache.maven.archetype.DefaultArchetype.generateProjectFromArchetype(DefaultArchetype.java:69)
at org.apache.maven.archetype.mojos.CreateProjectFromArchetypeMojo.execute(CreateProjectFromArchetypeMojo.java:184)
at org.apache.maven.plugin.DefaultBuildPluginManager.executeMojo(DefaultBuildPluginManager.java:133)
at org.twdata.maven.mojoexecutor.MojoExecutor.executeMojoImpl(MojoExecutor.java:172)
at org.twdata.maven.mojoexecutor.MojoExecutor$ExecutionEnvironmentM3.executeMojo(MojoExecutor.java:476)
at org.twdata.maven.mojoexecutor.MojoExecutor.executeMojo(MojoExecutor.java:75)
at com.atlassian.maven.plugins.amps.MavenGoals.createPlugin(MavenGoals.java:299)
at com.atlassian.maven.plugins.amps.CreateMojo.doExecute(CreateMojo.java:75)
at com.atlassian.maven.plugins.amps.AbstractProductHandlerMojo.execute(AbstractProductHandlerMojo.java:783)
at org.apache.maven.plugin.DefaultBuildPluginManager.executeMojo(DefaultBuildPluginManager.java:133)
at org.apache.maven.lifecycle.internal.MojoExecutor.execute(MojoExecutor.java:208)
at org.apache.maven.lifecycle.internal.MojoExecutor.execute(MojoExecutor.java:153)
at org.apache.maven.lifecycle.internal.MojoExecutor.execute(MojoExecutor.java:145)
at org.apache.maven.lifecycle.internal.LifecycleModuleBuilder.buildProject(LifecycleModuleBuilder.java:108)
at org.apache.maven.lifecycle.internal.LifecycleModuleBuilder.buildProject(LifecycleModuleBuilder.java:76)
at org.apache.maven.lifecycle.internal.builder.singlethreaded.SingleThreadedBuilder.build(SingleThreadedBuilder.java:51)
at org.apache.maven.lifecycle.internal.LifecycleStarter.execute(LifecycleStarter.java:116)
at org.apache.maven.DefaultMaven.doExecute(DefaultMaven.java:361)
at org.apache.maven.DefaultMaven.execute(DefaultMaven.java:155)
at org.apache.maven.cli.MavenCli.execute(MavenCli.java:584)
at org.apache.maven.cli.MavenCli.doMain(MavenCli.java:213)
at org.apache.maven.cli.MavenCli.main(MavenCli.java:157)
at sun.reflect.NativeMethodAccessorImpl.invoke0(Native Method)
at sun.reflect.NativeMethodAccessorImpl.invoke(Unknown Source)
at sun.reflect.DelegatingMethodAccessorImpl.invoke(Unknown Source)
at java.lang.reflect.Method.invoke(Unknown Source)
at org.codehaus.plexus.classworlds.launcher.Launcher.launchEnhanced(Launcher.java:289)
at org.codehaus.plexus.classworlds.launcher.Launcher.launch(Launcher.java:229)
at org.codehaus.plexus.classworlds.launcher.Launcher.mainWithExitCode(Launcher.java:415)
at org.codehaus.plexus.classworlds.launcher.Launcher.main(Launcher.java:356)
Caused by: org.apache.maven.archetype.exception.ArchetypeGenerationFailure: Error merging velocity templates: C:\Windows\System32\myPlugin\pom.xml (The system cannot find the path specified)
at org.apache.maven.archetype.generator.DefaultFilesetArchetypeGenerator.processTemplate(DefaultFilesetArchetypeGenerator.java:877)
at org.apache.maven.archetype.generator.DefaultFilesetArchetypeGenerator.processPom(DefaultFilesetArchetypeGenerator.java:748)
at org.apache.maven.archetype.generator.DefaultFilesetArchetypeGenerator.processFilesetProject(DefaultFilesetArchetypeGenerator.java:726)
at org.apache.maven.archetype.generator.DefaultFilesetArchetypeGenerator.processFilesetModule(DefaultFilesetArchetypeGenerator.java:637)
at org.apache.maven.archetype.generator.DefaultFilesetArchetypeGenerator.generateArchetype(DefaultFilesetArchetypeGenerator.java:244)
... 33 more
Caused by: java.io.FileNotFoundException: C:\Windows\System32\myPlugin\pom.xml (The system cannot find the path specified)
at java.io.FileOutputStream.open0(Native Method)
at java.io.FileOutputStream.open(Unknown Source)
at java.io.FileOutputStream.<init>(Unknown Source)
at java.io.FileOutputStream.<init>(Unknown Source)
at org.apache.maven.archetype.generator.DefaultFilesetArchetypeGenerator.processTemplate(DefaultFilesetArchetypeGenerator.java:869)
... 37 more
[INFO] ------------------------------------------------------------------------
[INFO] BUILD FAILURE
[INFO] ------------------------------------------------------------------------
[INFO] Total time: 02:13 min
[INFO] Finished at: 2018-12-07T13:40:44-08:00
[INFO] Final Memory: 11M/28M
[INFO] ------------------------------------------------------------------------
[ERROR] Failed to execute goal com.atlassian.maven.plugins:maven-jira-plugin:6.3.21:create (default-cli) on project standalone-pom: Unable to execute mojo: org.apache.maven.archetype.exception.ArchetypeGenerationFailure: Error merging velocity templates: C:\Windows\System32\myPlugin\pom.xml (The system cannot find the path specified) -> [Help 1]
[ERROR]
[ERROR] To see the full stack trace of the errors, re-run Maven with the -e switch.
[ERROR] Re-run Maven using the -X switch to enable full debug logging.
[ERROR]
[ERROR] For more information about the errors and possible solutions, please read the following articles:
[ERROR] [Help 1] http://cwiki.apache.org/confluence/display/MAVEN/MojoExecutionException
C:\Windows\System32>