I can't run integration test because jira can not start.
[INFO] [talledLocalContainer] 2018-08-02 10:35:28,721 Caesium-1-2 INFO [c.a.j.upgrade.util.BuildNumberDao] Setting current build number to 77002
[INFO] [talledLocalContainer] 2018-08-02 10:35:28,733 Caesium-1-2 INFO [c.a.jira.upgrade.LicenseCheckingUpgradeService]
[INFO] [talledLocalContainer]
[INFO] [talledLocalContainer] *******************************************************************
[INFO] [talledLocalContainer] Upgrade Succeeded! JIRA has been upgraded to build number 77001
[INFO] [talledLocalContainer] *******************************************************************
[INFO] [talledLocalContainer]
[INFO] [talledLocalContainer] 2018-08-02 10:35:28,735 Caesium-1-2 INFO [c.a.jira.upgrade.UpgradeIndexManager] There is no reindex requests of type [IMMEDIATE, DELAYED] so none will be run
[INFO] [talledLocalContainer] 2018-08-02 10:35:28,735 Caesium-1-2 INFO [c.a.j.upgrade.util.BuildNumberDao] Setting current version to 7.7.1
[INFO] [talledLocalContainer] 2018-08-02 10:35:28,740 Caesium-1-2 INFO [c.a.j.upgrade.util.BuildNumberDao] Setting downgrade version to 7.1.2
[INFO] [talledLocalContainer] 2018-08-02 10:35:28,749 Caesium-1-2 INFO [c.a.jira.upgrade.LoggingUpgradeService] run upgrades has finished successfully, and took 275 milliseconds to process.
[INFO] [talledLocalContainer] 2018-08-02 10:35:28,750 Caesium-1-2 INFO [c.a.jira.upgrade.UpgradeScheduler] JIRA upgrades completed successfully
[INFO] [talledLocalContainer] 2018-08-02 10:35:28,753 Caesium-1-2 INFO [c.a.jira.upgrade.UpgradeScheduler] Plugins upgrades completed successfully
[INFO] [talledLocalContainer] 2018-08-02 10:35:28,754 Caesium-1-2 INFO [c.a.jira.upgrade.UpgradeIndexManager] Reindexing is not allowed after this upgrade and there is no immediate reindex requests
[INFO] [talledLocalContainer] Aug 02, 2018 10:35:30 AM com.sun.jersey.server.impl.application.WebApplicationImpl _initiate
[INFO] [talledLocalContainer] INFO: Initiating Jersey application, version 'Jersey: 1.19 02/11/2015 03:25 AM'
[INFO] [talledLocalContainer] 2018-08-02 10:35:31,633 Caesium-1-2 DEBUG [c.a.activeobjects.osgi.ActiveObjectsServiceFactory] getService bundle [com.atlassian.troubleshooting.plugin-jira]
[INFO] Waiting for http://tiens-mbp-2.mgm-edv.de:2990/jira to start
[INFO] Waiting for http://tiens-mbp-2.mgm-edv.de:2990/jira to start
[INFO] Waiting for http://tiens-mbp-2.mgm-edv.de:2990/jira to start
[INFO] Waiting for http://tiens-mbp-2.mgm-edv.de:2990/jira to start
[INFO] Waiting for http://tiens-mbp-2.mgm-edv.de:2990/jira to start
[INFO] Waiting for http://tiens-mbp-2.mgm-edv.de:2990/jira to start
[INFO] Waiting for http://tiens-mbp-2.mgm-edv.de:2990/jira to start
[INFO] Waiting for http://tiens-mbp-2.mgm-edv.de:2990/jira to start
[INFO] ------------------------------------------------------------------------
[INFO] BUILD FAILURE
[INFO] ------------------------------------------------------------------------
[INFO] Total time: 13:44 min
[INFO] Finished at: 2018-08-02T10:44:42+01:00
[INFO] Final Memory: 63M/431M
[INFO] ------------------------------------------------------------------------
[ERROR] Failed to execute goal com.atlassian.maven.plugins:maven-jira-plugin:6.3.15:integration-test (default-integration-test) on project hierarchical-calculation-plugin: The product jira didn't start after 600s at http://tiens-mbp-2.mgm-edv.de:2990/jira. Operation timed out (Connection timed out) -> [Help 1]
[ERROR]
[ERROR] To see the full stack trace of the errors, re-run Maven with the -e switch.
[ERROR] Re-run Maven using the -X switch to enable full debug logging.
[ERROR]
[ERROR] For more information about the errors and possible solutions, please read the following articles:
[ERROR] [Help 1] http://cwiki.apache.org/confluence/display/MAVEN/MojoExecutionException
Any body have idea about this ?