I am new to atlassian-plugin-sdk, while running the command atlas-run-standalone --product jira, I am getting the following error
------------------------------------------------------------------------------------------------------------------------------------------
Microsoft Windows [Version 6.1.7601]
Copyright (c) 2009 Microsoft Corporation. All rights reserved.
C:\Users\aaaa>atlas-run-standalone --product jira
Executing: "D:\atlassian-plugin-sdk\apache-maven-3.2.1\bin\mvn.bat" com.atlassia
n.maven.plugins:maven-amps-plugin:5.0.13:run-standalone -gs
\atlassian-plugin-
sdk\apache-maven-3.2.1/conf/settings.xml -Dproduct=jira
[INFO] Scanning for projects...
[INFO]
[INFO] Using the builder org.apache.maven.lifecycle.internal.builder.singlethrea
ded.SingleThreadedBuilder with a thread count of 1
[INFO]
[INFO] ------------------------------------------------------------------------
[INFO] Building Maven Stub Project (No POM) 1
[INFO] ------------------------------------------------------------------------
[INFO]
[INFO] --- maven-amps-plugin:5.0.13:run-standalone (default-cli) @ standalone-po
m ---
Downloading: https://maven.atlassian.com/repository/public/com/atlassian/plugins
/rest/atlassian-rest-common/2.9.2-m01/atlassian-rest-common-2.9.2-m01.pom
Downloading: https://maven.atlassian.com/repository/public/com/sun/jersey/contri
bs/wadl-resourcedoc-doclet/1.8-atlassian-8/wadl-resourcedoc-doclet-1.8-atlassian
-8.pom
[INFO] ------------------------------------------------------------------------
[INFO] BUILD FAILURE
[INFO] ------------------------------------------------------------------------
[INFO] Total time: 4.018 s
[INFO] Finished at: 2015-02-20T10:27:34+05:30
[INFO] Final Memory: 9M/23M
[INFO] ------------------------------------------------------------------------
[ERROR] Failed to execute goal com.atlassian.maven.plugins:maven-amps-plugin:5.0
.13:run-standalone (default-cli) on project standalone-pom: Execution default-cl
i of goal com.atlassian.maven.plugins:maven-amps-plugin:5.0.13:run-standalone fa
iled: Plugin com.atlassian.maven.plugins:maven-amps-plugin:5.0.13 or one of its
dependencies could not be resolved: Failed to collect dependencies at com.atlass
ian.maven.plugins:maven-amps-plugin:jar:5.0.13 -> com.atlassian.plugins.rest:atl
assian-rest-doclet:jar:2.9.2 -> com.atlassian.jersey:atlassian-jersey-restdoc:ja
r:1.0.3 -> com.atlassian.plugins.rest:atlassian-rest-common:jar:2.9.2-m01: Faile
d to read artifact descriptor for com.atlassian.plugins.rest:atlassian-rest-comm
on:jar:2.9.2-m01: Could not transfer artifact com.atlassian.plugins.rest:atlassi
an-rest-common:pom:2.9.2-m01 from/to atlassian-public (https://maven.atlassian.c
om/repository/public): sun.security.validator.ValidatorException: PKIX path buil
ding failed: sun.security.provider.certpath.SunCertPathBuilderException: unable
to find valid certification path to requested target -> [Help 1]
[ERROR]
[ERROR] To see the full stack trace of the errors, re-run Maven with the -e swit
ch.
[ERROR] Re-run Maven using the -X switch to enable full debug logging.
[ERROR]
[ERROR] For more information about the errors and possible solutions, please rea
d the following articles:
[ERROR] [Help 1] http://cwiki.apache.org/confluence/display/MAVEN/PluginResoluti
onException
------------------------------------------------------------------------------------------------------------------------------------------
Please help me in solving this issue
Note: I have change my proxy setting in setting.xml in maven, but its of no use,
I am getting the same error again and again