i am trying to create a build using bitbucket pipeline and my project is using an external jar file for which i am getting the error, the issue was there on laptop too. but when i place the dependency on ./m2 direcotry it got resolved but i am not aware where to place it in bitbucketcloud my error that i am facing[ERROR] Failed to execute goal on project Demo: Could not resolve dependencies for project com.example:Demo:jar:0.0.1-SNAPSHOT: Could not find artifact com.comviva.cms:KpiCommonLib:jar:1.0 at specified path /opt/atlassian/pipelines/agent/build\src\lib\KpiCommonLib-1.0.jar -> [Help 1]
10:38 am
error logs last few lines.
Skipping Demo
[INFO] This project has been banned from the build due to previous failures.
[INFO] ------------------------------------------------------------------------
[INFO] ------------------------------------------------------------------------
[INFO] BUILD FAILURE
[INFO] ------------------------------------------------------------------------
[INFO] Total time: 7.858 s
[INFO] Finished at: 2021-10-01T09:11:55Z
[INFO] ------------------------------------------------------------------------
[ERROR] Failed to execute goal on project Demo: Could not resolve dependencies for project com.example:Demo:jar:0.0.1-SNAPSHOT: Could not find artifact com.comviva.cms:KpiCommonLib:jar:1.0 at specified path /opt/atlassian/pipelines/agent/build\src\lib\KpiCommonLib-1.0.jar -> [Help 1]
[ERROR]