"Suddenly" atlas-debug fails on all my development machines, because sdk is "Unable to find/resolve artifact ... synchrony-proxy:war:RELEASE".
Any suggestions?
[INFO] BUILD FAILURE[INFO] ------------------------------------------------------------------------[INFO] Total time: 20.401 s[INFO] Finished at: 2021-01-09T17:00:14+01:00[INFO] ------------------------------------------------------------------------[ERROR] Failed to execute goal com.atlassian.maven.plugins:amps-dispatcher-maven-plugin:8.1.0:debug (default-cli) on project jojo: Unable to find/resolve artifact.: Failed to read artifact descriptor for com.atlassian.synchrony:synchrony-proxy:war:RELEASE: Failed to resolve version for com.atlassian.synchrony:synchrony-proxy:war:RELEASE: Could not find metadata com.atlassian.synchrony:synchrony-proxy/maven-metadata.xml in local (C:\Users\Dirk Brutscher\.m2\repository) -> [Help 1]org.apache.maven.lifecycle.LifecycleExecutionException: Failed to execute goal com.atlassian.maven.plugins:amps-dispatcher-maven-plugin:8.1.0:debug (default-cli) on project jojo: Unable to find/resolve artifact.