hi all,
when i tried to compile my jira plugin i've got this:
[ERROR] BUILD FAILURE [INFO] ------------------------------------------------------------------------ [INFO] Compilation failure /home/........./src/main/java/com/............. .java:[8,39] cannot find symbol symbol : class elements location: package org.codehaus.cargo.module.webapp
[ERROR] BUILD FAILURE
[INFO] ------------------------------------------------------------------------
[INFO] Compilation failure
/home/........./src/main/java/com/............. .java:[8,39] cannot find symbol
symbol : class elements
location: package org.codehaus.cargo.module.webapp
and i tried to add its dependency ,but doesn't work
<dependency> <groupId>org.codehaus.cargo</groupId> <artifactId>cargo-core-api-container</artifactId> <version>1.4.4</version> </dependency>
did you ran atlas-mvn eclipse:eclipse command?
thanks rambanam
yes i did try
can you try this
<dependency> <groupId>org.codehaus.cargo</groupId> <artifactId>cargo-core-api-container</artifactId> <version>1.4.4</version> <scope>provided</scope> </dependency>
after adding this to pom.xml run atlas-mvn eclipse:eclipse command
It looks like you're new here. Sign in or register to get started.