here is full stack trace
java.lang.reflect.InvocationTargetException
at sun.reflect.NativeMethodAccessorImpl.invoke0(Native Method)
at sun.reflect.NativeMethodAccessorImpl.invoke(NativeMethodAccessorImpl.java:62)
at sun.reflect.DelegatingMethodAccessorImpl.invoke(DelegatingMethodAccessorImpl.java:43)
at java.lang.reflect.Method.invoke(Method.java:498)
at org.codehaus.mojo.exec.ExecJavaMojo$1.run(ExecJavaMojo.java:293)
at java.lang.Thread.run(Thread.java:748)
Caused by: RestClientException{statusCode=Optional.of(401), errorCollections=[]}
at com.atlassian.jira.rest.client.internal.async.DelegatingPromise.claim(DelegatingPromise.java:45)
at com.app.ConnectJira.main(ConnectJira.java:37)
... 6 more
Caused by: RestClientException{statusCode=Optional.of(401), errorCollections=[]}
at com.atlassian.jira.rest.client.internal.async.AbstractAsynchronousRestClient$2.apply(AbstractAsynchronousRestClient.java:178)
at com.atlassian.jira.rest.client.internal.async.AbstractAsynchronousRestClient$2.apply(AbstractAsynchronousRestClient.java:170)
at com.atlassian.httpclient.api.ResponsePromiseMapFunction.apply(ResponsePromiseMapFunction.java:49)
at com.atlassian.httpclient.api.ResponsePromiseMapFunction.apply(ResponsePromiseMapFunction.java:10)
at io.atlassian.util.concurrent.Promises$OfStage.lambda$fold$4(Promises.java:332)
at io.atlassian.util.concurrent.Promises.lambda$biFunction$7(Promises.java:422)
at java.util.concurrent.CompletableFuture.uniHandle(CompletableFuture.java:822)
at java.util.concurrent.CompletableFuture$UniHandle.tryFire(CompletableFuture.java:797)
at java.util.concurrent.CompletableFuture.postComplete(CompletableFuture.java:474)
at java.util.concurrent.CompletableFuture.complete(CompletableFuture.java:1962)
at com.atlassian.httpclient.apache.httpcomponents.SettableFuturePromiseHttpPromiseAsyncClient$1.lambda$doCompleted$0(SettableFuturePromiseHttpPromiseAsyncClient.java:37)
at com.atlassian.httpclient.apache.httpcomponents.SettableFuturePromiseHttpPromiseAsyncClient.runInContext(SettableFuturePromiseHttpPromiseAsyncClient.java:61)
at com.atlassian.httpclient.apache.httpcomponents.SettableFuturePromiseHttpPromiseAsyncClient$ThreadLocalDelegateRunnable.run(SettableFuturePromiseHttpPromiseAsyncClient.java:129)
at java.util.concurrent.ThreadPoolExecutor.runWorker(ThreadPoolExecutor.java:1149)
at java.util.concurrent.ThreadPoolExecutor$Worker.run(ThreadPoolExecutor.java:624)
... 1 more
Caused by: org.codehaus.jettison.json.JSONException: A JSONObject text must begin
<head>
<title>Unauthorized (401)</title>
<!--[if IE]><![endif]-->
<script type="text/javascript" >
var contextPath = '';
var DeferScripts = { deferState: 'disabled' };
</script>
<script>
ll">
<meta name="application-name" content="JIRA" data-name="jira" data-version="1001.0.0-SNAPSHOT">
</head>
<body id="jira" class="aui-layout aui-style-default page-type-message" data-version="1001.0.0-SNAPSHOT" >
<div class="aui-page-panel"><div class="aui-page-panel-inner">
<section class="aui-page-panel-content">
<header class="aui-page-header"><div class="aui-page-header-inner">
<div class="aui-page-header-main">
<h1>Unauthorized (401)</h1>
</div><!-- .aui-page-header-main -->
</div><!-- .aui-page-header-inner --></header><!-- .aui-page-header -->
<div class="aui-message aui-message-warning warning">
<p>Encountered a <code>"401 - Unauthorized"</code> error while loading this page.</p>
<p><a href="/secure/MyJiraHome.jspa">Go to Jira home</a></p>
</div>
</section><!-- .aui-page-panel-content -->
</div><!-- .aui-page-panel-inner --></div><!-- .aui-page-panel -->
</body>
</html>
at org.codehaus.jettison.json.JSONTokener.syntaxError(JSONTokener.java:463)
at org.codehaus.jettison.json.JSONObject.<init>(JSONObject.java:206)
at org.codehaus.jettison.json.JSONObject.<init>(JSONObject.java:313)
at com.atlassian.jira.rest.client.internal.async.AbstractAsynchronousRestClient.extractErrors(AbstractAsynchronousRestClient.java:212)
at com.atlassian.jira.rest.client.internal.async.AbstractAsynchronousRestClient$2.apply(AbstractAsynchronousRestClient.java:175)
... 15 more
[INFO] ------------------------------------------------------------------------
[INFO] BUILD FAILURE
[INFO] ------------------------------------------------------------------------
[INFO] Total time: 5.516 s
[INFO] Finished at: 2019-05-05T21:20:15+05:00
[INFO] Final Memory: 14M/34M
[INFO] ------------------------------------------------------------------------
[ERROR] Failed to execute goal org.codehaus.mojo:exec-maven-plugin:1.4.0:java (default) on project PSR: An exception occured while executing the Java class. null: InvocationTargetException: org.codehaus.jettison.json.JSONException: A JSONObject text must begin with '{' at character 1 of <html>
[ERROR]
[ERROR] <head>
[ERROR] <title>Unauthorized (401)</title>
[ERROR] <meta name="application-name" content="JIRA" data-name="jira" data-version="1001.0.0-SNAPSHOT">
[ERROR] </head>
[ERROR] <body id="jira" class="aui-layout aui-style-default page-type-message" data-version="1001.0.0-SNAPSHOT" >
[ERROR] <div class="aui-page-panel"><div class="aui-page-panel-inner">
[ERROR] <section class="aui-page-panel-content">
[ERROR] <header class="aui-page-header"><div class="aui-page-header-inner">
[ERROR] <div class="aui-page-header-main">
[ERROR] <h1>Unauthorized (401)</h1>
[ERROR] </div><!-- .aui-page-header-main -->
[ERROR] </div><!-- .aui-page-header-inner --></header><!-- .aui-page-header -->
[ERROR] <div class="aui-message aui-message-warning warning">
[ERROR] <p>Encountered a <code>"401 - Unauthorized"</code> error while loading this page.</p>
[ERROR] <p><a href="/secure/MyJiraHome.jspa">Go to Jira home</a></p>
[ERROR] </div>
[ERROR] </section><!-- .aui-page-panel-content -->
[ERROR] </div><!-- .aui-page-panel-inner --></div><!-- .aui-page-panel -->
[ERROR] </body>
[ERROR] </html>