Hi All,
I can able to publish the specs till now in bamboo, but all of a sudden I am facing this issue.
Can any one advise me how to resolve this?
[INFO] Running class Publish
2018-12-27 13:03:17,355 INFO [BambooServer] Publishing plan APPS-SAMAS
2018-12-27 13:03:20,440 INFO [BambooServer] An error occurred while publishing plan APPS-SAMAS: Could not parse key 'null'
2018-12-27 13:03:20,440 INFO [BambooServer] (for more information, enable more detailed logging with system property -Dbamboo.specs.log.level=DEBUG)
[INFO] ------------------------------------------------------------------------
[INFO] BUILD FAILURE
[INFO] ------------------------------------------------------------------------
[INFO] Total time: 4.815 s
[INFO] Finished at: 2018-12-27T13:03:20+05:30
[INFO] ------------------------------------------------------------------------
[ERROR] Failed to execute goal com.atlassian.bamboo:bamboo-specs-runner:6.6.1:run (default-cli) on project bamboo: Execution default-cli of goal com.atlassian.bamboo:bamboo-specs-runner:6.6.1:run failed: java.lang.reflect.InvocationTargetException: An error occurred while publishing plan APPS-SAMAS: Could not parse key 'null' -> [Help 1]
org.apache.maven.lifecycle.LifecycleExecutionException: Failed to execute goal com.atlassian.bamboo:bamboo-specs-runner:6.6.1:run (default-cli) on project bamboo: Execution default-cli of goal com.atlassian.bamboo:bamboo-specs-runner:6.6.1:run failed: java.lang.reflect.InvocationTargetException
at org.apache.maven.lifecycle.internal.MojoExecutor.execute (MojoExecutor.java:215)
at org.apache.maven.lifecycle.internal.MojoExecutor.execute (MojoExecutor.java:156)
at org.apache.maven.lifecycle.internal.MojoExecutor.execute (MojoExecutor.java:148)
at org.apache.maven.lifecycle.internal.LifecycleModuleBuilder.buildProject (LifecycleModuleBuilder.java:117)
at org.apache.maven.lifecycle.internal.LifecycleModuleBuilder.buildProject (LifecycleModuleBuilder.java:81)
at org.apache.maven.lifecycle.internal.builder.singlethreaded.SingleThreadedBuilder.build (SingleThreadedBuilder.java:56)
at org.apache.maven.lifecycle.internal.LifecycleStarter.execute (LifecycleStarter.java:128)
at org.apache.maven.DefaultMaven.doExecute (DefaultMaven.java:305)
at org.apache.maven.DefaultMaven.doExecute (DefaultMaven.java:192)
at org.apache.maven.DefaultMaven.execute (DefaultMaven.java:105)
at org.apache.maven.cli.MavenCli.execute (MavenCli.java:956)
at org.apache.maven.cli.MavenCli.doMain (MavenCli.java:288)
at org.apache.maven.cli.MavenCli.main (MavenCli.java:192)
at sun.reflect.NativeMethodAccessorImpl.invoke0 (Native Method)
at sun.reflect.NativeMethodAccessorImpl.invoke (NativeMethodAccessorImpl.java:62)
at sun.reflect.DelegatingMethodAccessorImpl.invoke (DelegatingMethodAccessorImpl.java:43)
at java.lang.reflect.Method.invoke (Method.java:498)
at org.codehaus.plexus.classworlds.launcher.Launcher.launchEnhanced (Launcher.java:289)
at org.codehaus.plexus.classworlds.launcher.Launcher.launch (Launcher.java:229)
at org.codehaus.plexus.classworlds.launcher.Launcher.mainWithExitCode (Launcher.java:415)
at org.codehaus.plexus.classworlds.launcher.Launcher.main (Launcher.java:356)
Caused by: org.apache.maven.plugin.PluginExecutionException: Execution default-cli of goal com.atlassian.bamboo:bamboo-specs-runner:6.6.1:run failed: java.lang.reflect.InvocationTargetException