why does nothing happen when i click record
Hi @jakemaisel2 ,
Are you using the desktop app or browser extension? Or maybe the mobile app? You could try reinstalling the app to see if that helps. 👀
What I'd suggest is following these troubleshooting steps: Collect recorder logs for troubleshooting As the article states, you can reach out to Loom support and send them logs from your app to review. 🎟️
Cheers,Tobi
I just got this too, have been recording looms yesterday just fine - this is using loom.com web app
dev tools is showing this:
[Violation] 'message' handler took 155mschrome-extension://invalid/:1 GET chrome-extension://invalid/ net::ERR_FAILEDImagei @ 58206-47c2df5c68c3cf63.js:27(anonymous) @ 58206-47c2df5c68c3cf63.js:27(anonymous) @ 72952-6c5749eaab465fa7.js:15ia @ react-vendor-fe305f4da4ddcd4b.js:21uu @ react-vendor-fe305f4da4ddcd4b.js:21i9 @ react-vendor-fe305f4da4ddcd4b.js:21lc @ react-vendor-fe305f4da4ddcd4b.js:19(anonymous) @ react-vendor-fe305f4da4ddcd4b.js:21ui @ react-vendor-fe305f4da4ddcd4b.js:21i2 @ react-vendor-fe305f4da4ddcd4b.js:21T @ 63775-0bfb11bdb2973ac3.js:627N @ 63775-0bfb11bdb2973ac3.js:62763775-0bfb11bdb2973ac3.js:559 WARN [Statsig] The user does not have the required id_type "tenantId" for Gate "platform-dst-motion-uplift"(anonymous) @ 63775-0bfb11bdb2973ac3.js:559warn @ 63775-0bfb11bdb2973ac3.js:637_checkUserHasIdForEvaluation @ 63775-0bfb11bdb2973ac3.js:637(anonymous) @ 63775-0bfb11bdb2973ac3.js:637_capture @ 63775-0bfb11bdb2973ac3.js:637e.<computed> @ 63775-0bfb11bdb2973ac3.js:637_getFeatureGateImpl @ 63775-0bfb11bdb2973ac3.js:637(anonymous) @ 63775-0bfb11bdb2973ac3.js:637_capture @ 63775-0bfb11bdb2973ac3.js:637e.<computed> @ 63775-0bfb11bdb2973ac3.js:637(anonymous) @ 63775-0bfb11bdb2973ac3.js:637checkGate @ 63775-0bfb11bdb2973ac3.js:637(anonymous) @ 63775-0bfb11bdb2973ac3.js:637_capture @ 63775-0bfb11bdb2973ac3.js:637e.<computed> @ 63775-0bfb11bdb2973ac3.js:637value @ 63775-0bfb11bdb2973ac3.js:186(anonymous) @ 63775-0bfb11bdb2973ac3.js:186b @ 63775-0bfb11bdb2973ac3.js:187(anonymous) @ 69802-e40d3619f3dac5f3.js:4a_ @ react-vendor-fe305f4da4ddcd4b.js:19oM @ react-vendor-fe305f4da4ddcd4b.js:21u @ react-vendor-fe305f4da4ddcd4b.js:21ua @ react-vendor-fe305f4da4ddcd4b.js:21ul @ react-vendor-fe305f4da4ddcd4b.js:21i2 @ react-vendor-fe305f4da4ddcd4b.js:21T @ 63775-0bfb11bdb2973ac3.js:627N @ 63775-0bfb11bdb2973ac3.js:627postMessagen @ 63775-0bfb11bdb2973ac3.js:627N @ 63775-0bfb11bdb2973ac3.js:627chrome-extension://invalid/:1 GET chrome-extension://invalid/ net::ERR_FAILEDImagei @ 58206-47c2df5c68c3cf63.js:27(anonymous) @ 58206-47c2df5c68c3cf63.js:27rL @ 58206-47c2df5c68c3cf63.js:27C.o @ 5894-f9d0757ad2b9accc.js:101C @ 5894-f9d0757ad2b9accc.js:101onButtonClick @ 5894-f9d0757ad2b9accc.js:101onSelect @ 54989-3d23bc02116262ee.js:1466(anonymous) @ 63775-0bfb11bdb2973ac3.js:616at @ react-vendor-fe305f4da4ddcd4b.js:19iv @ react-vendor-fe305f4da4ddcd4b.js:21e @ react-vendor-fe305f4da4ddcd4b.js:21e @ react-vendor-fe305f4da4ddcd4b.js:21e @ react-vendor-fe305f4da4ddcd4b.js:21(anonymous) @ react-vendor-fe305f4da4ddcd4b.js:21ui @ react-vendor-fe305f4da4ddcd4b.js:21i9 @ react-vendor-fe305f4da4ddcd4b.js:21lc @ react-vendor-fe305f4da4ddcd4b.js:19(anonymous) @ react-vendor-fe305f4da4ddcd4b.js:21videos:1 Failed to launch 'loomdesktop://' because the scheme does not have a registered handler.22180-f4afeaee1545f9ad.js:478 Uncaught (in promise) TypeError: t is not a functionm @ 22180-f4afeaee1545f9ad.js:478await in mu @ 22180-f4afeaee1545f9ad.js:478await in usetup @ 22180-f4afeaee1545f9ad.js:478waitOnInstance @ 22180-f4afeaee1545f9ad.js:478F @ 5894-f9d0757ad2b9accc.js:101P @ 5894-f9d0757ad2b9accc.js:101await in PC @ 5894-f9d0757ad2b9accc.js:101C @ 5894-f9d0757ad2b9accc.js:101await in CC @ 5894-f9d0757ad2b9accc.js:101await in ConButtonClick @ 5894-f9d0757ad2b9accc.js:101onSelect @ 54989-3d23bc02116262ee.js:1466(anonymous) @ 63775-0bfb11bdb2973ac3.js:616at @ react-vendor-fe305f4da4ddcd4b.js:19iv @ react-vendor-fe305f4da4ddcd4b.js:21e @ react-vendor-fe305f4da4ddcd4b.js:21e @ react-vendor-fe305f4da4ddcd4b.js:21e @ react-vendor-fe305f4da4ddcd4b.js:21(anonymous) @ react-vendor-fe305f4da4ddcd4b.js:21ui @ react-vendor-fe305f4da4ddcd4b.js:21i9 @ react-vendor-fe305f4da4ddcd4b.js:21lc @ react-vendor-fe305f4da4ddcd4b.js:19(anonymous) @ react-vendor-fe305f4da4ddcd4b.js:2163775-0bfb11bdb2973ac3.js:201 [Violation] 'setInterval' handler took 279ms
notably:
chrome-extension://invalid/:1 GET chrome-extension://invalid/ net::ERR_FAILED
videos:1 Failed to launch 'loomdesktop://' because the scheme does not have a registered handler.
seems its trying to run either the extension or the desktop custom-scheme and i have neither loom extension nor loom desktop installed
On Mac m2 Tahoe 26.5.1
and of course - right as i post the bug report it works now - same errors in dev tools but it works - perhaps something was cached
It looks like you're new here. Sign in or register to get started.