Discussions
Categories
Groups
Help
Home
Q&A
Bamboo
build failuers
Naveen Babu
24-Mar-2019 12:51:47
[INFO] Scanning for projects...
24-Mar-2019 12:51:47
[INFO] ------------------------------------------------------------------------
24-Mar-2019 12:51:47
[INFO] BUILD FAILURE
24-Mar-2019 12:51:47
[INFO] ------------------------------------------------------------------------
24-Mar-2019 12:51:47
[INFO] Total time: 0.141 s
24-Mar-2019 12:51:47
[INFO] Finished at: 2019-03-24T12:51:47+05:30
24-Mar-2019 12:51:47
[INFO] ------------------------------------------------------------------------
24-Mar-2019 12:51:47
[ERROR] The goal you specified requires a project to execute but there is no POM in this directory (C:\Program Files\Bamboo\bin\xml-data\build-dir\ANZ-TEST-JOB1). Please verify you invoked Maven from the correct directory. -> [Help 1]
24-Mar-2019 12:51:47
[ERROR]
24-Mar-2019 12:51:47
[ERROR] To see the full stack trace of the errors, re-run Maven with the -e switch.
24-Mar-2019 12:51:47
[ERROR] Re-run Maven using the -X switch to enable full debug logging.
24-Mar-2019 12:51:47
[ERROR]
24-Mar-2019 12:51:47
[ERROR] For more information about the errors and possible solutions, please read the following articles:
24-Mar-2019 12:51:47
[ERROR] [Help 1]
http://cwiki.apache.org/confluence/display/MAVEN/MissingProjectException
Accepted answers
All comments
Naveen Babu
24-Mar-2019 12:51:47
[INFO] Scanning for projects...
24-Mar-2019 12:51:47
[INFO] ------------------------------------------------------------------------
24-Mar-2019 12:51:47
[INFO] BUILD FAILURE
24-Mar-2019 12:51:47
[INFO] ------------------------------------------------------------------------
24-Mar-2019 12:51:47
[INFO] Total time: 0.141 s
24-Mar-2019 12:51:47
[INFO] Finished at: 2019-03-24T12:51:47+05:30
24-Mar-2019 12:51:47
[INFO] ------------------------------------------------------------------------
24-Mar-2019 12:51:47
[ERROR] The goal you specified requires a project to execute but there is no POM in this directory (C:\Program Files\Bamboo\bin\xml-data\build-dir\ANZ-TEST-JOB1). Please verify you invoked Maven from the correct directory. -> [Help 1]
24-Mar-2019 12:51:47
[ERROR]
24-Mar-2019 12:51:47
[ERROR] To see the full stack trace of the errors, re-run Maven with the -e switch.
24-Mar-2019 12:51:47
[ERROR] Re-run Maven using the -X switch to enable full debug logging.
24-Mar-2019 12:51:47
[ERROR]
24-Mar-2019 12:51:47
[ERROR] For more information about the errors and possible solutions, please read the following articles:
24-Mar-2019 12:51:47
[ERROR] [Help 1]
http://cwiki.apache.org/confluence/display/MAVEN/MissingProjectException
Welcome!
It looks like you're new here. Sign in or register to get started.
Sign In
Register
Quick Links
Unanswered
Groups
Help
Find more posts tagged with
bamboo