Create
cancel
Showing results for 
Search instead for 
Did you mean: 
Sign up Log in

Next challenges

Recent achievements

  • Global
  • Personal

Recognition

  • Give kudos
  • Received
  • Given

Leaderboard

  • Global

Trophy case

Kudos (beta program)

Kudos logo

You've been invited into the Kudos (beta program) private group. Chat with others in the program, or give feedback to Atlassian.

View group

It's not the same without you

Join the community to find out what other Atlassian users are discussing, debating and creating.

Atlassian Community Hero Image Collage

Building clover

I am not able to build the clover open source code. i get the following error. Looks like there is a dependency in the code on jars that I do not have access to. 

 

Buildfile: /Users/<username>/development/clover/build.xml
[exec] Result: 1
[get] Destination already exists (skipping): /Users/<username>/development/clover/target/dependencies/maven-ant-tasks-2.1.3.jar
[get] Destination already exists (skipping): /Users/<username>/development/clover/target/dependencies/ant-contrib-1.0b3.jar
[get] Getting: https://storage.googleapis.com/google-code-archive-downloads/v2/code.google.com/jarjar/jarjar-1.0rc7.jar
[get] To: /Users/<username>/development/clover/target/dependencies/jarjar-1.0rc7.jar
[get] Error getting https://storage.googleapis.com/google-code-archive-downloads/v2/code.google.com/jarjar/jarjar-1.0rc7.jar to /Users/<username>/development/clover/target/dependencies/jarjar-1.0rc7.jar

BUILD FAILED
/Users/<username>/development/clover/build.xml:4: The following error occurred while executing this line:
/Users/<username>/development/clover/clover-ant/build.xml:3: The following error occurred while executing this line:
/Users/<username>/development/clover/clover-core/build.xml:3: The following error occurred while executing this line:
/Users/<username>/development/clover/clover-buildutil/build.xml:3: The following error occurred while executing this line:
/Users/<username>/development/clover/common.xml:79: javax.net.ssl.SSLHandshakeException: sun.security.validator.ValidatorException: PKIX path building failed: sun.security.provider.certpath.SunCertPathBuilderException: unable to find valid certification path to requested target
at sun.security.ssl.Alerts.getSSLException(Alerts.java:192)
at sun.security.ssl.SSLSocketImpl.fatal(SSLSocketImpl.java:1964)
at sun.security.ssl.Handshaker.fatalSE(Handshaker.java:328)
at sun.security.ssl.Handshaker.fatalSE(Handshaker.java:322)
at sun.security.ssl.ClientHandshaker.serverCertificate(ClientHandshaker.java:1614)
at sun.security.ssl.ClientHandshaker.processMessage(ClientHandshaker.java:216)
at sun.security.ssl.Handshaker.processLoop(Handshaker.java:1052)
at sun.security.ssl.Handshaker.process_record(Handshaker.java:987)
at sun.security.ssl.SSLSocketImpl.readRecord(SSLSocketImpl.java:1072)
at sun.security.ssl.SSLSocketImpl.performInitialHandshake(SSLSocketImpl.java:1385)
at sun.security.ssl.SSLSocketImpl.startHandshake(SSLSocketImpl.java:1413)
at sun.security.ssl.SSLSocketImpl.startHandshake(SSLSocketImpl.java:1397)
at sun.net.www.protocol.https.HttpsClient.afterConnect(HttpsClient.java:559)
at sun.net.www.protocol.https.AbstractDelegateHttpsURLConnection.connect(AbstractDelegateHttpsURLConnection.java:185)
at sun.net.www.protocol.https.HttpsURLConnectionImpl.connect(HttpsURLConnectionImpl.java:162)
at org.apache.tools.ant.taskdefs.Get$GetThread.openConnection(Get.java:766)
at org.apache.tools.ant.taskdefs.Get$GetThread.get(Get.java:681)
at org.apache.tools.ant.taskdefs.Get$GetThread.run(Get.java:671)
Caused by: sun.security.validator.ValidatorException: PKIX path building failed: sun.security.provider.certpath.SunCertPathBuilderException: unable to find valid certification path to requested target
at sun.security.validator.PKIXValidator.doBuild(PKIXValidator.java:397)
at sun.security.validator.PKIXValidator.engineValidate(PKIXValidator.java:302)
at sun.security.validator.Validator.validate(Validator.java:260)
at sun.security.ssl.X509TrustManagerImpl.validate(X509TrustManagerImpl.java:324)
at sun.security.ssl.X509TrustManagerImpl.checkTrusted(X509TrustManagerImpl.java:229)
at sun.security.ssl.X509TrustManagerImpl.checkServerTrusted(X509TrustManagerImpl.java:124)
at sun.security.ssl.ClientHandshaker.serverCertificate(ClientHandshaker.java:1596)
... 13 more
Caused by: sun.security.provider.certpath.SunCertPathBuilderException: unable to find valid certification path to requested target
at sun.security.provider.certpath.SunCertPathBuilder.build(SunCertPathBuilder.java:141)
at sun.security.provider.certpath.SunCertPathBuilder.engineBuild(SunCertPathBuilder.java:126)
at java.security.cert.CertPathBuilder.build(CertPathBuilder.java:280)
at sun.security.validator.PKIXValidator.doBuild(PKIXValidator.java:392)
... 19 more

1 answer

Which JDK do you use?

Suggest an answer

Log in or Sign up to answer
TAGS
Community showcase
Published in Trello

📹 What is a Trello board?

Hi, Atlassian Community! My name is Brittany Joiner and I am a Trello enthusiast and Atlassian Community Leader. I'll be sharing with you a series of videos with my top tips on how to best use Tre...

14 views 0 3
Read article

Community Events

Connect with like-minded Atlassian users at free events near you!

Find an event

Connect with like-minded Atlassian users at free events near you!

Unfortunately there are no Community Events near you at the moment.

Host an event

You're one step closer to meeting fellow Atlassian users at your local event. Learn more about Community Events

Events near you