It's not the same without you

Join the community to find out what other Atlassian users are discussing, debating and creating.

Atlassian Community Hero Image Collage
Highlighted

build failuers

24-Mar-2019 12:51:47[INFO] Scanning for projects...
24-Mar-2019 12:51:47[INFO] ------------------------------------------------------------------------
24-Mar-2019 12:51:47[INFO] BUILD FAILURE
24-Mar-2019 12:51:47[INFO] ------------------------------------------------------------------------
24-Mar-2019 12:51:47[INFO] Total time: 0.141 s
24-Mar-2019 12:51:47[INFO] Finished at: 2019-03-24T12:51:47+05:30
24-Mar-2019 12:51:47[INFO] ------------------------------------------------------------------------
24-Mar-2019 12:51:47[ERROR] The goal you specified requires a project to execute but there is no POM in this directory (C:\Program Files\Bamboo\bin\xml-data\build-dir\ANZ-TEST-JOB1). Please verify you invoked Maven from the correct directory. -> [Help 1]
24-Mar-2019 12:51:47[ERROR]
24-Mar-2019 12:51:47[ERROR] To see the full stack trace of the errors, re-run Maven with the -e switch.
24-Mar-2019 12:51:47[ERROR] Re-run Maven using the -X switch to enable full debug logging.
24-Mar-2019 12:51:47[ERROR]
24-Mar-2019 12:51:47[ERROR] For more information about the errors and possible solutions, please read the following articles:
24-Mar-2019 12:51:47[ERROR] [Help 1] http://cwiki.apache.org/confluence/display/MAVEN/MissingProjectException

1 comment

24-Mar-2019 12:51:47[INFO] Scanning for projects...
24-Mar-2019 12:51:47[INFO] ------------------------------------------------------------------------
24-Mar-2019 12:51:47[INFO] BUILD FAILURE
24-Mar-2019 12:51:47[INFO] ------------------------------------------------------------------------
24-Mar-2019 12:51:47[INFO] Total time: 0.141 s
24-Mar-2019 12:51:47[INFO] Finished at: 2019-03-24T12:51:47+05:30
24-Mar-2019 12:51:47[INFO] ------------------------------------------------------------------------
24-Mar-2019 12:51:47[ERROR] The goal you specified requires a project to execute but there is no POM in this directory (C:\Program Files\Bamboo\bin\xml-data\build-dir\ANZ-TEST-JOB1). Please verify you invoked Maven from the correct directory. -> [Help 1]
24-Mar-2019 12:51:47[ERROR]
24-Mar-2019 12:51:47[ERROR] To see the full stack trace of the errors, re-run Maven with the -e switch.
24-Mar-2019 12:51:47[ERROR] Re-run Maven using the -X switch to enable full debug logging.
24-Mar-2019 12:51:47[ERROR]
24-Mar-2019 12:51:47[ERROR] For more information about the errors and possible solutions, please read the following articles:
24-Mar-2019 12:51:47[ERROR] [Help 1] http://cwiki.apache.org/confluence/display/MAVEN/MissingProjectException

Comment

Log in or Sign up to comment
TAGS
Community showcase
Published in Bamboo

Bamboo 7.1 is here and is packed with value!

I'm happy to announce that Bamboo 7.1 has been released and it’s overflowing with awesome new features. Top-voted issues First and foremost, a bunch of JAC top voted issues has been delivered - y...

311 views 0 6
Read article

Community Events

Connect with like-minded Atlassian users at free events near you!

Find an event

Connect with like-minded Atlassian users at free events near you!

Unfortunately there are no Community Events near you at the moment.

Host an event

You're one step closer to meeting fellow Atlassian users at your local event. Learn more about Community Events

Events near you